BDBM50205981 2-[2-[(1,3-benzodioxol-5-ylmethyl)amino]-2-oxoethyl]-4-[2-(1H-imidazol-1-yl)-6-methyl-4-pyrimidinyl]-1-piperazinecarboxylic acid, methyl ester::CHEMBL222619
SMILES COC(=O)N1CCN(CC1CC(=O)NCc1ccc2OCOc2c1)c1cc(C)nc(n1)-n1ccnc1
InChI Key InChIKey=BHPZTAGGZNBTOV-UHFFFAOYSA-N
Data  1 IC50
  Tab Delimited (TSV)   2D SDfile   Computed 3D by Vconf -m prep SDfile
Find this compound or compounds like it in BindingDB:
Activity Spreadsheet -- Enzyme Inhibition Constant Data from BindingDB
Found 1 hit for monomerid = 50205981
TargetNitric oxide synthase, inducible(Homo sapiens (Human))
Berlex Biosciences
Curated by ChEMBL
LigandPNGBDBM50205981(2-[2-[(1,3-benzodioxol-5-ylmethyl)amino]-2-oxoethy...)
Affinity DataIC50:  5.40nM. Assay description: Inhibition of cytokine-induced iNOS expressed in human A172 cells assessed as inhibition of NO formation
In DepthDetails ArticlePubMed