BDBM50206483 (2R,3S,4R,5R)-2-(5-((E)-2-bromovinyl)-2,4-dioxo-3,4-dihydropyrimidin-1(2H)-yl)-4-hydroxy-5-(hydroxymethyl)-tetrahydrofuran-3-yl 2-methoxyacetate::CHEMBL399413
SMILES COCC(=O)O[C@H]1[C@H](O)[C@@H](CO)O[C@H]1n1cc(C=CBr)c(=O)[nH]c1=O
InChI Key InChIKey=NNONZLUPBQRBKD-GMTLJSCSSA-N
Data  5 IC50
  Tab Delimited (TSV)   2D SDfile   Computed 3D by Vconf -m prep SDfile
Find this compound or compounds like it in BindingDB:
Activity Spreadsheet -- Enzyme Inhibition Constant Data from BindingDB
Found 5 hits for monomerid = 50206483
TargetThymidine kinase(Varicella-zoster virus (strain Dumas) (HHV-3) (Hum...)
University Of Ferrara
Curated by ChEMBL
LigandPNGBDBM50206483((2R,3S,4R,5R)-2-(5-((E)-2-bromovinyl)-2,4-dioxo-3,...)
Affinity DataIC50:  3.50E+4nM. Assay description: Inhibition of VZV TK assessed as [methyl-3H]dThd phosphorylation
In DepthDetails ArticlePubMed
TargetThymidine kinase, cytosolic(Homo sapiens (Human))
University Of Ferrara
Curated by ChEMBL
LigandPNGBDBM50206483((2R,3S,4R,5R)-2-(5-((E)-2-bromovinyl)-2,4-dioxo-3,...)
Affinity DataIC50: >1.00E+6nM. Assay description: Inhibition of human TK1 assessed as [methyl-3H]dThd phosphorylation
In DepthDetails ArticlePubMed
TargetThymidine kinase(Human herpesvirus 1 (strain SC16) (HHV-1) (Human h...)
University Of Ferrara
Curated by ChEMBL
LigandPNGBDBM50206483((2R,3S,4R,5R)-2-(5-((E)-2-bromovinyl)-2,4-dioxo-3,...)
Affinity DataIC50:  8.40E+4nM. Assay description: Inhibition of HSV1 TK assessed as [methyl-3H]dThd phosphorylation
In DepthDetails ArticlePubMed
TargetThymidine kinase 2, mitochondrial(Homo sapiens (Human))
University Of Ferrara
Curated by ChEMBL
LigandPNGBDBM50206483((2R,3S,4R,5R)-2-(5-((E)-2-bromovinyl)-2,4-dioxo-3,...)
Affinity DataIC50:  4.02E+5nM. Assay description: Inhibition of human TK2 assessed as [methyl-3H]dThd phosphorylation
In DepthDetails ArticlePubMed
TargetDeoxynucleoside kinase(Drosophila melanogaster)
University Of Ferrara
Curated by ChEMBL
LigandPNGBDBM50206483((2R,3S,4R,5R)-2-(5-((E)-2-bromovinyl)-2,4-dioxo-3,...)
Affinity DataIC50:  2.15E+5nM. Assay description: Inhibition of Drosophila melanogaster dNK assessed as [methyl-3H]dThd phosphorylation
In DepthDetails ArticlePubMed