BDBM50207855 CHEMBL245744::N-(3-isopropylphenyl)-4-methyl-3-(3-(4-(methylamino)-1,3,5-triazin-2-yl)pyridin-2-yloxy)benzamide
SMILES CNc1ncnc(n1)-c1cccnc1Oc1cc(ccc1C)C(=O)Nc1cccc(c1)C(C)C
InChI Key InChIKey=CKFIBJSVBPYSCR-UHFFFAOYSA-N
Data  2 IC50
  Tab Delimited (TSV)   2D SDfile   Computed 3D by Vconf -m prep SDfile
Find this compound or compounds like it in BindingDB:
Activity Spreadsheet -- Enzyme Inhibition Constant Data from BindingDB
Found 2 hits for monomerid = 50207855
TargetAngiopoietin-1 receptor(Homo sapiens (Human))
Amgen
Curated by ChEMBL
LigandPNGBDBM50207855(CHEMBL245744 | N-(3-isopropylphenyl)-4-methyl-3-(3...)
Affinity DataIC50:  1nM. Assay description: Inhibition of Tie2 after 90 mins by HTRF assay
In DepthDetails ArticlePubMed
TargetVascular endothelial growth factor receptor 2(Homo sapiens (Human))
Amgen
Curated by ChEMBL
LigandPNGBDBM50207855(CHEMBL245744 | N-(3-isopropylphenyl)-4-methyl-3-(3...)
Affinity DataIC50:  20nM. Assay description: Inhibition of KDR after 90 mins by HTRF assay
In DepthDetails ArticlePubMed