BDBM50208737 CHEMBL3884746
SMILES CN(C)S(=O)(=O)NC[C@H]1O[C@H]([C@H](O)[C@@H]1O)n1c(SCC(=O)NCCc2ccc(Cl)c(Cl)c2)nc2c(N)ncnc12
InChI Key InChIKey=LORGREDLEBJVKW-HAXDFEGKSA-N
Data  1 KI
  Tab Delimited (TSV)   2D SDfile   Computed 3D by Vconf -m prep SDfile
Find this compound or compounds like it in BindingDB:
Activity Spreadsheet -- Enzyme Inhibition Constant Data from BindingDB
Found 1 hit for monomerid = 50208737
TargetNAD kinase(Homo sapiens (Human))
France Cnrs
Curated by ChEMBL
LigandPNGBDBM50208737(CHEMBL3884746)
Affinity DataKi:  1.60E+5nM. Assay description: Inhibition of human NADK expressed in Escherichia coli BL21(DE3) assessed as reduction in NADP production using NAD as substrate by glucose-6-phospha...
In DepthDetails ArticlePubMed