BDBM50208950 1-(4-chlorophenyl)-N-cyclohexyl-2-phenyl-1H-imidazole-4-carboxamide::CHEMBL425662
SMILES Clc1ccc(cc1)-n1cc(nc1-c1ccccc1)C(=O)NC1CCCCC1
InChI Key InChIKey=DASFMUKQHMITOG-UHFFFAOYSA-N
Data  1 KI
  Tab Delimited (TSV)   2D SDfile   Computed 3D by Vconf -m prep SDfile
Find this compound or compounds like it in BindingDB:
Activity Spreadsheet -- Enzyme Inhibition Constant Data from BindingDB
Found 1 hit for monomerid = 50208950
TargetCannabinoid receptor 1(Homo sapiens (Human))
Bayer Healthcare
Curated by ChEMBL
LigandPNGBDBM50208950(1-(4-chlorophenyl)-N-cyclohexyl-2-phenyl-1H-imidaz...)
Affinity DataKi:  130nM. Assay description: Displacement of [3H]CP559440 from human CB1 receptor expressed in HEK293 cells
In DepthDetails ArticlePubMed