BDBM50208955 2-(2-chlorophenyl)-N-cyclohexyl-1-p-tolyl-1H-imidazole-4-carboxamide::CHEMBL229749
SMILES Cc1ccc(cc1)-n1cc(nc1-c1ccccc1Cl)C(=O)NC1CCCCC1
InChI Key InChIKey=HWZHRQCIYAZCNG-UHFFFAOYSA-N
Data  1 KI
  Tab Delimited (TSV)   2D SDfile   Computed 3D by Vconf -m prep SDfile
Find this compound or compounds like it in BindingDB:
Activity Spreadsheet -- Enzyme Inhibition Constant Data from BindingDB
Found 1 hit for monomerid = 50208955
TargetCannabinoid receptor 1(Homo sapiens (Human))
Bayer Healthcare
Curated by ChEMBL
LigandPNGBDBM50208955(2-(2-chlorophenyl)-N-cyclohexyl-1-p-tolyl-1H-imida...)
Affinity DataKi:  4.60nM. Assay description: Displacement of [3H]CP559440 from human CB1 receptor expressed in HEK293 cells
In DepthDetails ArticlePubMed