BDBM50208959 CHEMBL230583::rac-2-(2-chlorophenyl)-1-(4-chlorophenyl)-N-((1S,2S)-1-hydroxy-2,3-dihydro-1H-inden-2-yl)-1H-imidazole-4-carboxamide
SMILES O[C@@H]1[C@H](Cc2ccccc12)NC(=O)c1cn(c(n1)-c1ccccc1Cl)-c1ccc(Cl)cc1
InChI Key InChIKey=BSYJXMRHTYHKRJ-GMAHTHKFSA-N
Data  1 KI
  Tab Delimited (TSV)   2D SDfile   Computed 3D by Vconf -m prep SDfile
Find this compound or compounds like it in BindingDB:
Activity Spreadsheet -- Enzyme Inhibition Constant Data from BindingDB
Found 1 hit for monomerid = 50208959
TargetCannabinoid receptor 1(Homo sapiens (Human))
Bayer Healthcare
Curated by ChEMBL
LigandPNGBDBM50208959(CHEMBL230583 | rac-2-(2-chlorophenyl)-1-(4-chlorop...)
Affinity DataKi:  41nM. Assay description: Displacement of [3H]CP559440 from human CB1 receptor expressed in HEK293 cells
In DepthDetails ArticlePubMed