BDBM50208965 CHEMBL389198::rac-1-(4-chlorophenyl)-2-(2,4-dichlorophenyl)-N-(2-hydroxycyclohexyl)-1H-imidazole-4-carboxamide
SMILES OC1CCCCC1NC(=O)c1cn(c(n1)-c1ccc(Cl)cc1Cl)-c1ccc(Cl)cc1
InChI Key InChIKey=IMULKGNJBJYZHH-UHFFFAOYSA-N
Data  2 KI
  Tab Delimited (TSV)   2D SDfile   Computed 3D by Vconf -m prep SDfile
Find this compound or compounds like it in BindingDB:
Activity Spreadsheet -- Enzyme Inhibition Constant Data from BindingDB
Found 2 hits for monomerid = 50208965
TargetCannabinoid receptor 1(Homo sapiens (Human))
Bayer Healthcare
Curated by ChEMBL
LigandPNGBDBM50208965(CHEMBL389198 | rac-1-(4-chlorophenyl)-2-(2,4-dichl...)
Affinity DataKi:  22nM. Assay description: Displacement of [3H]CP559440 from human CB1 receptor expressed in HEK293 cells
In DepthDetails ArticlePubMed
TargetCannabinoid receptor 2(Homo sapiens (Human))
Bayer Healthcare
Curated by ChEMBL
LigandPNGBDBM50208965(CHEMBL389198 | rac-1-(4-chlorophenyl)-2-(2,4-dichl...)
Affinity DataKi:  1.10E+3nM. Assay description: Displacement of [3H]CP559440 from human CB2 receptor expressed in HEK293 cells
In DepthDetails ArticlePubMed