BDBM50209398 1,2-bis(3,4-difluorophenyl)-2-hydroxyethanone::CHEMBL394557
SMILES OC(C(=O)c1ccc(F)c(F)c1)c1ccc(F)c(F)c1
InChI Key InChIKey=VPCIITRKAXBIRA-UHFFFAOYSA-N
Data  4 KI
  Tab Delimited (TSV)   2D SDfile   Computed 3D by Vconf -m prep SDfile
Find this compound or compounds like it in BindingDB:
Activity Spreadsheet -- Enzyme Inhibition Constant Data from BindingDB
Found 4 hits for monomerid = 50209398
TargetCocaine esterase(Homo sapiens (Human))
St. Jude Children'S Research Hospital
Curated by ChEMBL
LigandPNGBDBM50209398(1,2-bis(3,4-difluorophenyl)-2-hydroxyethanone | CH...)
Affinity DataKi:  150nM. Assay description: Inhibition of human intestinal carboxylesterase
In DepthDetails ArticlePubMed
TargetLiver carboxylesterase 1(Homo sapiens (Human))
St. Jude Children'S Research Hospital
Curated by ChEMBL
LigandPNGBDBM50209398(1,2-bis(3,4-difluorophenyl)-2-hydroxyethanone | CH...)
Affinity DataKi:  1.30E+3nM. Assay description: Inhibition of human carboxylesterase 1
In DepthDetails ArticlePubMed
TargetAcetylcholinesterase(Homo sapiens (Human))
St. Jude Children'S Research Hospital
Curated by ChEMBL
LigandPNGBDBM50209398(1,2-bis(3,4-difluorophenyl)-2-hydroxyethanone | CH...)
Affinity DataKi: >1.00E+5nM. Assay description: Inhibition of human AChE
In DepthDetails ArticlePubMed
TargetCholinesterase(Homo sapiens (Human))
St. Jude Children'S Research Hospital
Curated by ChEMBL
LigandPNGBDBM50209398(1,2-bis(3,4-difluorophenyl)-2-hydroxyethanone | CH...)
Affinity DataKi: >1.00E+5nM. Assay description: Inhibition of human BChE
In DepthDetails ArticlePubMed