BDBM50209458 (beta1R)-3,5-dichloro-b-[[[[3-[(5-hydroxy-1,4,5,6-tetrahydro-2-pyrimidinyl)-hydroxy]benzoyl]amino]acetyl] amino]-2-hydroxybenzenepropionic acid::CHEMBL395339
SMILES [#8]-[#6]-1-[#6]-[#7]\[#6](-[#7]-[#6]-1)=[#7]\c1cc(-[#8])cc(c1)-[#6](=O)-[#7]-[#6]-[#6](=O)-[#7]-[#6@H](-[#6]-[#6](-[#8])=O)-c1cc(Cl)cc(Cl)c1-[#8]
InChI Key InChIKey=ZABQRLFKWHUGJA-QGZVFWFLSA-N
Data  2 IC50
  Tab Delimited (TSV)   2D SDfile   Computed 3D by Vconf -m prep SDfile
Find this compound or compounds like it in BindingDB:
Activity Spreadsheet -- Enzyme Inhibition Constant Data from BindingDB
Found 2 hits for monomerid = 50209458
TargetIntegrin alpha-V/beta-6(Homo sapiens (Human))
Pfizer
Curated by ChEMBL
LigandPNGBDBM50209458((beta1R)-3,5-dichloro-b-[[[[3-[(5-hydroxy-1,4,5,6-...)
Affinity DataIC50:  64nM. Assay description: Inhibition of alphaVbeta6 integrin receptor in human 293 cells
In DepthDetails ArticlePubMed
TargetIntegrin alpha-V/beta-3(Homo sapiens (Human))
Pfizer
Curated by ChEMBL
LigandPNGBDBM50209458((beta1R)-3,5-dichloro-b-[[[[3-[(5-hydroxy-1,4,5,6-...)
Affinity DataIC50:  3nM. Assay description: Inhibition of alphaVbeta3 integrin receptor expressed in human 293 cells
In DepthDetails ArticlePubMed