BDBM50209460 (3R)-3-(3-bromo-5-chloro-2-hydroxyphenyl)-3-(2-(3-(5-hydroxy-1,4,5,6-tetrahydropyrimidin-2-ylamino)nicotinamido)acetamido)propanoic acid::CHEMBL389827
SMILES [#8]-[#6]-1-[#6]-[#7]\[#6](-[#7]-[#6]-1)=[#7]\c1cncc(c1)-[#6](=O)-[#7]-[#6]-[#6](=O)-[#7]-[#6@H](-[#6]-[#6](-[#8])=O)-c1cc(Cl)cc(Br)c1-[#8]
InChI Key InChIKey=IJCLIKANGQOCLK-MRXNPFEDSA-N
Data  2 IC50
  Tab Delimited (TSV)   2D SDfile   Computed 3D by Vconf -m prep SDfile
Find this compound or compounds like it in BindingDB:
Activity Spreadsheet -- Enzyme Inhibition Constant Data from BindingDB
Found 2 hits for monomerid = 50209460
TargetIntegrin alpha-V/beta-3(Homo sapiens (Human))
Pfizer
Curated by ChEMBL
LigandPNGBDBM50209460((3R)-3-(3-bromo-5-chloro-2-hydroxyphenyl)-3-(2-(3-...)
Affinity DataIC50:  1nM. Assay description: Inhibition of alphaVbeta3 integrin receptor expressed in human 293 cells
In DepthDetails ArticlePubMed
TargetIntegrin alpha-V/beta-6(Homo sapiens (Human))
Pfizer
Curated by ChEMBL
LigandPNGBDBM50209460((3R)-3-(3-bromo-5-chloro-2-hydroxyphenyl)-3-(2-(3-...)
Affinity DataIC50:  615nM. Assay description: Inhibition of alphaVbeta6 integrin receptor in human 293 cells
In DepthDetails ArticlePubMed