BDBM50210666 (R)-ethyl 7-(3-amino-4-(2,4,5-trifluorophenyl)butanoyl)-5,6,7,8-tetrahydro-[1,2,4]triazolo[4,3-a]pyrazine-3-carboxylate::CHEMBL233686
SMILES CCOC(=O)c1nnc2CN(CCn12)C(=O)C[C@H](N)Cc1cc(F)c(F)cc1F
InChI Key InChIKey=WJPONMSVJMVDFW-LLVKDONJSA-N
Data  3 IC50
  Tab Delimited (TSV)   2D SDfile   Computed 3D by Vconf -m prep SDfile
Find this compound or compounds like it in BindingDB:
Activity Spreadsheet -- Enzyme Inhibition Constant Data from BindingDB
Found 3 hits for monomerid = 50210666
TargetDipeptidyl peptidase 9(Homo sapiens (Human))
Merck Research Laboratories
Curated by ChEMBL
LigandPNGBDBM50210666((R)-ethyl 7-(3-amino-4-(2,4,5-trifluorophenyl)buta...)
Affinity DataIC50:  7.80E+4nM. Assay description: Inhibition of DPP9 activity
In DepthDetails ArticlePubMed
TargetDipeptidyl peptidase 8(Homo sapiens (Human))
Merck Research Laboratories
Curated by ChEMBL
LigandPNGBDBM50210666((R)-ethyl 7-(3-amino-4-(2,4,5-trifluorophenyl)buta...)
Affinity DataIC50: >2.20E+4nM. Assay description: Inhibition of DPP8 activity
In DepthDetails ArticlePubMed
TargetDipeptidyl peptidase 4(Homo sapiens (Human))
Merck Research Laboratories
Curated by ChEMBL
LigandPNGBDBM50210666((R)-ethyl 7-(3-amino-4-(2,4,5-trifluorophenyl)buta...)
Affinity DataIC50:  219nM. Assay description: Inhibition of DPP4 activity
In DepthDetails ArticlePubMed