BDBM50210798 CHEMBL3930969
SMILES Nc1ncc(-c2ccc(O)c(O)c2)c(n1)-c1ccccc1
InChI Key InChIKey=QMWYYSGDEGNNOR-UHFFFAOYSA-N
Data  2 KI
  Tab Delimited (TSV)   2D SDfile   Computed 3D by Vconf -m prep SDfile
Find this compound or compounds like it in BindingDB:
Activity Spreadsheet -- Enzyme Inhibition Constant Data from BindingDB
Found 2 hits for monomerid = 50210798
TargetAdenosine receptor A2a(Homo sapiens (Human))
Leiden University
Curated by ChEMBL
LigandPNGBDBM50210798(CHEMBL3930969)
Affinity DataKi:  4.70nM. Assay description: Displacement of [3H]ZM241385 from recombinant human adenosine A2A receptor expressed in HEK293 cell membranes after 2 hrs by beta scintillation count...
In DepthDetails ArticlePubMed
TargetAdenosine receptor A1(Homo sapiens (Human))
Leiden University
Curated by ChEMBL
LigandPNGBDBM50210798(CHEMBL3930969)
Affinity DataKi:  12nM. Assay description: Displacement of [3H]DPCPX from recombinant human adenosine A1 receptor expressed in CHO cell membranes after 1 hr by beta scintillation counting meth...
In DepthDetails ArticlePubMed