BDBM50211286 5-[4-(6-bromo-2,3-dihydrobenzo[1,4]dioxin-2-ylmethoxy)-benzylidene]-thiazolidine-2,4-dione::CHEMBL243412
SMILES OC1=NC(=O)C(S1)=Cc1ccc(OCC2COc3cc(Br)ccc3O2)cc1
InChI Key InChIKey=BAQRTFHZKSTUQR-UHFFFAOYSA-N
Data  1 KI
  Tab Delimited (TSV)   2D SDfile   Computed 3D by Vconf -m prep SDfile
Find this compound or compounds like it in BindingDB:
Activity Spreadsheet -- Enzyme Inhibition Constant Data from BindingDB
Found 1 hit for monomerid = 50211286
TargetGlycogen phosphorylase, liver form(Homo sapiens (Human))
University Of Debrecen
Curated by ChEMBL
LigandPNGBDBM50211286(5-[4-(6-bromo-2,3-dihydrobenzo[1,4]dioxin-2-ylmeth...)
Affinity DataKi:  8.00E+4nM. Assay description: Inhibition of liver glycogen phosphorylase B
In DepthDetails ArticlePubMed