BDBM50212609 CHEMBL228409::Dmt-Pro-Dmp-Phe-NH2
SMILES Cc1cccc(C)c1C[C@H](NC(=O)[C@@H]1CCCN1C(=O)[C@@H](N)Cc1c(C)cc(O)cc1C)C(=O)N[C@@H](Cc1ccccc1)C(N)=O
InChI Key InChIKey=KIPQYPCUMMQKJB-YDPTYEFTSA-N
Data  3 KI  1 IC50
  Tab Delimited (TSV)   2D SDfile   Computed 3D by Vconf -m prep SDfile
Find this compound or compounds like it in BindingDB:
Activity Spreadsheet -- Enzyme Inhibition Constant Data from BindingDB
Found 4 hits for monomerid = 50212609
TargetMu-type opioid receptor(Rattus norvegicus (rat))
Kobe Gakuin University
Curated by ChEMBL
LigandPNGBDBM50212609(CHEMBL228409 | Dmt-Pro-Dmp-Phe-NH2)
Affinity DataKi:  0.0690nM. Assay description: Displacement of [3H]DAMGO from mu opioid receptor in Sprague-Dawley rat brain P2 synaptosome membrane
In DepthDetails ArticlePubMed
TargetDelta-type opioid receptor(Rattus norvegicus (rat))
Kobe Gakuin University
Curated by ChEMBL
LigandPNGBDBM50212609(CHEMBL228409 | Dmt-Pro-Dmp-Phe-NH2)
Affinity DataKi:  2.27nM. Assay description: Displacement of [3H]deltorphin 2 from delta opioid receptor in Sprague-Dawley rat brain P2 synaptosome membrane
In DepthDetails ArticlePubMed
TargetKappa-type opioid receptor(Cavia porcellus (domestic guinea pig))
Kobe Gakuin University
Curated by ChEMBL
LigandPNGBDBM50212609(CHEMBL228409 | Dmt-Pro-Dmp-Phe-NH2)
Affinity DataKi:  94.2nM. Assay description: Displacement of [3H]U69,593 from kappa opioid receptor in Hartley guinea pig cerebellum P2 synaptosome membrane
In DepthDetails ArticlePubMed
TargetMu-type opioid receptor(GUINEA PIG)
Kobe Gakuin University
Curated by ChEMBL
LigandPNGBDBM50212609(CHEMBL228409 | Dmt-Pro-Dmp-Phe-NH2)
Affinity DataIC50:  0.120nM. Assay description: Agonist activity at mu opioid receptor in Hartley guinea pig ileum assessed as inhibition of electrically-stimulated muscle contraction
In DepthDetails ArticlePubMed