BDBM50214650 1-(2,6-dichloro-4-trifluoromethylphenyl)-4,5-diethyl-1H-1,2,3-triazole::CHEMBL392036
SMILES CCc1nnn(c1CC)-c1c(Cl)cc(cc1Cl)C(F)(F)F
InChI Key InChIKey=UNBQMUNNSLPLLQ-UHFFFAOYSA-N
Data  2 KI
  Tab Delimited (TSV)   2D SDfile   Computed 3D by Vconf -m prep SDfile
Find this compound or compounds like it in BindingDB:
Activity Spreadsheet -- Enzyme Inhibition Constant Data from BindingDB
Found 2 hits for monomerid = 50214650
TargetGamma-aminobutyric acid receptor subunit beta-3(Homo sapiens (Human))
Shimane University
Curated by ChEMBL
LigandPNGBDBM50214650(1-(2,6-dichloro-4-trifluoromethylphenyl)-4,5-dieth...)
Affinity DataKi:  4.30nM. Assay description: Displacement of [3H]EBOB from human recombinant GABAbeta3 receptor expressed in HEK293 cells
In DepthDetails ArticlePubMed
TargetGamma-aminobutyric acid receptor subunit alpha-2/beta-2/gamma-2(Homo sapiens (Human))
Shimane University
Curated by ChEMBL
LigandPNGBDBM50214650(1-(2,6-dichloro-4-trifluoromethylphenyl)-4,5-dieth...)
Affinity DataKi:  959nM. Assay description: Displacement of [3H]EBOB from human recombinant GABA alpha-1-beta-2-gamma-2 receptor expressed in HEK293 cells
In DepthDetails ArticlePubMed