BDBM50214793 CHEMBL3142595
SMILES [#7]-[#6@H](-[#6]-[#6]-[#6]\[#7]=[#6](/[#7])-[#7])-[#6](=O)-[#7]-[#6@@H](-[#6]-[#6]-[#6]-[#7]-[#6](-[#7])=[#7])-[#6](=O)-[#7]-[#6]-[#6]-[#6]-[#6]-[#6]-[#6]-[#6]-[#6]-[#6]-[#6]-[#6]-[#6](=O)-[#7]-[#6@@H](-[#6]-[#8])-[#6](=O)-[#7]-1-[#6]-[#6]-c2ccccc2-[#6@@H]-1-[#6](=O)-[#7]-1-[#6]-2-[#6]-[#6]-[#6]-[#6]-[#6]-2-[#6]-[#6@H]-1-[#6](=O)-[#7]-[#6@@H](-[#6]-[#6]-[#6]\[#7]=[#6](\[#7])-[#7])-[#6](-[#8])=O
InChI Key InChIKey=WCYLLYUFSJWVEO-LJWGEHNSSA-N
Data  1 KI
  Tab Delimited (TSV)   2D SDfile   Computed 3D by Vconf -m prep SDfile
Find this compound or compounds like it in BindingDB:
Activity Spreadsheet -- Enzyme Inhibition Constant Data from BindingDB
Found 1 hit for monomerid = 50214793
TargetB2 bradykinin receptor(Cavia porcellus)
TBA
Curated by ChEMBL
LigandPNGBDBM50214793(CHEMBL3142595)
Affinity DataKi:  360nM. Assay description: Compound was evaluated for inhibitory activity against [3H]-BK in the classical guinea pig ileum B2 binding assay
In DepthDetails Article