BDBM50215214 1-(2,6-difluorobenzyl)-6-(4-chlorobenzyl)-3-(2-(methyl(2-(pyridin-2-yl)ethyl)amino)ethyl)-5,6,7,8-tetrahydropyrido[4,3-d]pyrimidine-2,4(1H,3H)-dione::CHEMBL236127
SMILES CN(CCc1ccccn1)CCn1c(=O)c2CN(Cc3ccc(Cl)cc3)CCc2n(Cc2c(F)cccc2F)c1=O
InChI Key InChIKey=YWXWWLFOSYCWIB-UHFFFAOYSA-N
Data  1 KI
  Tab Delimited (TSV)   2D SDfile   Computed 3D by Vconf -m prep SDfile
Find this compound or compounds like it in BindingDB:
Activity Spreadsheet -- Enzyme Inhibition Constant Data from BindingDB
Found 1 hit for monomerid = 50215214
TargetGonadotropin-releasing hormone receptor(Homo sapiens (Human))
Neurocrine Biosciences
Curated by ChEMBL
LigandPNGBDBM50215214(1-(2,6-difluorobenzyl)-6-(4-chlorobenzyl)-3-(2-(me...)
Affinity DataKi:  17nM. Assay description: Displacement of [125I-His5,D-Tyr6]GnRH from human cloned GnRH receptor transfected in COS7 cells
In DepthDetails ArticlePubMed