BDBM50215538 CHEMBL52090
SMILES O=S(=O)(NCCCCCCCc1c[nH]cn1)c1ccc2ccccc2c1
InChI Key InChIKey=UUAWWISMNODERN-UHFFFAOYSA-N
Data  2 KI
  Tab Delimited (TSV)   2D SDfile   Computed 3D by Vconf -m prep SDfile
Find this compound or compounds like it in BindingDB:
Activity Spreadsheet -- Enzyme Inhibition Constant Data from BindingDB
Found 2 hits for monomerid = 50215538
TargetHistamine H3 receptor(GUINEA PIG)
The James Black Foundation
Curated by ChEMBL
LigandPNGBDBM50215538(CHEMBL52090)
Affinity DataKi:  40nM. Assay description: Binding affinity towards histamine H3 receptor using [3H](R)-alpha-methylhistamine as radioligand in guinea pig ileum LMMP homogenates
In DepthDetails ArticlePubMed
TargetHistamine H3 receptor(GUINEA PIG)
The James Black Foundation
Curated by ChEMBL
LigandPNGBDBM50215538(CHEMBL52090)
Affinity DataKi:  50nM. Assay description: Binding affinity towards histamine H3 receptor using [3H](R)-alpha-methylhistamine as radioligand in guinea pig cortical homogenates
In DepthDetails ArticlePubMed