BDBM50215567 CHEMBL37299
SMILES NC(=N)c1ccc(cc1)N1CCN(CC1)c1ccc(CCC(O)=O)cc1
InChI Key InChIKey=BSPHRVJKGKZMED-UHFFFAOYSA-N
Data  1 IC50
  Tab Delimited (TSV)   2D SDfile   Computed 3D by Vconf -m prep SDfile
Find this compound or compounds like it in BindingDB:
Activity Spreadsheet -- Enzyme Inhibition Constant Data from BindingDB
Found 1 hit for monomerid = 50215567
TargetIntegrin alpha-IIb/beta-3(Homo sapiens (Human))
Solvay Pharma
Curated by ChEMBL
LigandPNGBDBM50215567(CHEMBL37299)
Affinity DataIC50:  25nM. Assay description: Inhibition of fibrinogen binding to platelet glycoprotein alpha IIb beta-3 integrin in ELISA
In DepthDetails ArticlePubMed