BDBM50216294 CHEMBL449708
SMILES COCc1nc2c(OC)ccc(C(=O)Nc3c(Cl)cncc3Cl)c2[nH]1
InChI Key InChIKey=APZGHLKUAICCAJ-UHFFFAOYSA-N
Data  1 IC50
  Tab Delimited (TSV)   2D SDfile   Computed 3D by Vconf -m prep SDfile
Find this compound or compounds like it in BindingDB:
Activity Spreadsheet -- Enzyme Inhibition Constant Data from BindingDB
Found 1 hit for monomerid = 50216294
TargetcAMP-specific 3',5'-cyclic phosphodiesterase 4A/4B/4C/4D(Homo sapiens (Human))
Rh£Ne-Poulenc Rorer
Curated by ChEMBL
LigandPNGBDBM50216294(CHEMBL449708)
Affinity DataIC50:  42nM. Assay description: Inhibition of PDE4 from guinea pig macrophages
In DepthDetails ArticlePubMed