BDBM50216864 CHEMBL64721
SMILES Fc1ccc(CN2CC3COc4ccc(cc4C3C2)C#N)cc1
InChI Key InChIKey=UVDIFPYXVNSROD-UHFFFAOYSA-N
Data  2 KI
  Tab Delimited (TSV)   2D SDfile   Computed 3D by Vconf -m prep SDfile
Find this compound or compounds like it in BindingDB:
Activity Spreadsheet -- Enzyme Inhibition Constant Data from BindingDB
Found 2 hits for monomerid = 50216864
TargetD(3) dopamine receptor(Homo sapiens (Human))
Centre De Recherches De Croissy
Curated by ChEMBL
LigandPNGBDBM50216864(CHEMBL64721)
Affinity DataKi:  7.90nM. Assay description: Ability to displace [125I]iodosulpiride from human dopamine D3 (hD3) receptor transfected into CHO cells.
In DepthDetails ArticlePubMed
TargetD(2) dopamine receptor(Homo sapiens (Human))
Centre De Recherches De Croissy
Curated by ChEMBL
LigandPNGBDBM50216864(CHEMBL64721)
Affinity DataKi:  79nM. Assay description: Ability to displace [125I]iodosulpiride from human dopamine D2 (hD2) receptor transfected into CHO cells.
In DepthDetails ArticlePubMed