BDBM50216875 CHEMBL436157
SMILES CCCN1CC2COc3ccc(cc3C2C1)C#N
InChI Key InChIKey=GDYQVHUWFCXMBW-UHFFFAOYSA-N
Data  2 KI
  Tab Delimited (TSV)   2D SDfile   Computed 3D by Vconf -m prep SDfile
Find this compound or compounds like it in BindingDB:
Activity Spreadsheet -- Enzyme Inhibition Constant Data from BindingDB
Found 2 hits for monomerid = 50216875
TargetD(3) dopamine receptor(Homo sapiens (Human))
Centre De Recherches De Croissy
Curated by ChEMBL
LigandPNGBDBM50216875(CHEMBL436157)
Affinity DataKi:  16nM. Assay description: Ability to displace [125I]iodosulpiride from human dopamine D3 (hD3) receptor transfected into CHO cells.
In DepthDetails ArticlePubMed
TargetD(2) dopamine receptor(Homo sapiens (Human))
Centre De Recherches De Croissy
Curated by ChEMBL
LigandPNGBDBM50216875(CHEMBL436157)
Affinity DataKi:  126nM. Assay description: Ability to displace [125I]iodosulpiride from human dopamine D2 (hD2) receptor transfected into CHO cells.
In DepthDetails ArticlePubMed