BDBM50216917 2-(cyclooctylamino)-5,5-diethyloxazol-4(5H)-one::CHEMBL238187
SMILES CCC1(CC)OC(NC2CCCCCCC2)=NC1=O
InChI Key InChIKey=RCJPILQMNSKTFG-UHFFFAOYSA-N
Data  2 KI
  Tab Delimited (TSV)   2D SDfile   Computed 3D by Vconf -m prep SDfile
Find this compound or compounds like it in BindingDB:
Activity Spreadsheet -- Enzyme Inhibition Constant Data from BindingDB
Found 2 hits for monomerid = 50216917
Target11-beta-hydroxysteroid dehydrogenase 1(Homo sapiens (Human))
Biovitrum
Curated by ChEMBL
LigandPNGBDBM50216917(2-(cyclooctylamino)-5,5-diethyloxazol-4(5H)-one | ...)
Affinity DataKi:  10nM. Assay description: Binding affinity to human 11beta-HSD1 by SPA assay
In DepthDetails ArticlePubMed
Target11-beta-hydroxysteroid dehydrogenase type 2(Homo sapiens (Human))
Biovitrum
Curated by ChEMBL
LigandPNGBDBM50216917(2-(cyclooctylamino)-5,5-diethyloxazol-4(5H)-one | ...)
Affinity DataKi: >1.00E+4nM. Assay description: Binding affinity to human 11beta-HSD2
In DepthDetails ArticlePubMed