BDBM50217111 CHEMBL1790704
SMILES [H][C@@]12[#6]-[#6]-[#6]-[#7]1-[#6](=O)-[#6@@H](-[#6]-[#6]-[#6]\[#7]=[#6](/[#7])-[#7])-[#7]-[#6](=O)-[#6]-[#6]-[#6]-[#6]-[#6]-[#8]-c1ccc(-[#6]-[#6@H](-[#7]-[#6]2=O)-[#6](=O)-[#7]-[#6@H](-[#6@H](-[#6])-[#6]-[#6])-[#6](=O)-[#7]-[#6@@H](-[#6]-[#6](-[#6])-[#6])-[#6](-[#8])=O)cc1
InChI Key InChIKey=LTVAGLBMDPWQGE-PGHZORDASA-N
Data  1 KI
  Tab Delimited (TSV)   2D SDfile   Computed 3D by Vconf -m prep SDfile
Find this compound or compounds like it in BindingDB:
Activity Spreadsheet -- Enzyme Inhibition Constant Data from BindingDB
Found 1 hit for monomerid = 50217111
TargetNeurotensin receptor type 1/2(Homo sapiens (Human))
Medical University Of South Carolina
Curated by ChEMBL
LigandPNGBDBM50217111(CHEMBL1790704)
Affinity DataKi:  450nM. Assay description: Binding ability to compete with [125I]Tyr3-NT (0.15 nM) for human NT receptors cloned in CHO cells.
In DepthDetails ArticlePubMed