BDBM50218001 ({2-[4-benzo[1,3]dioxol-5-yl-2-(thiophene-2-carbonyl)-phenoxy]-ethyl}-methyl-amino)-acetic acid::CHEMBL250171
SMILES CN(CCOc1ccc(cc1C(=O)c1cccs1)-c1ccc2OCOc2c1)CC(O)=O
InChI Key InChIKey=ORVWECBJFICHMX-UHFFFAOYSA-N
Data  2 IC50
  Tab Delimited (TSV)   2D SDfile   Computed 3D by Vconf -m prep SDfile
Find this compound or compounds like it in BindingDB:
Activity Spreadsheet -- Enzyme Inhibition Constant Data from BindingDB
Found 2 hits for monomerid = 50218001
TargetSodium- and chloride-dependent glycine transporter 2(Homo sapiens (Human))
Eli Lilly
Curated by ChEMBL
LigandPNGBDBM50218001(({2-[4-benzo[1,3]dioxol-5-yl-2-(thiophene-2-carbon...)
Affinity DataIC50: >3.00E+4nM. Assay description: Inhibition of [14C]glycine reuptake at human GlyT2 expressed in BE(2)-C cells
In DepthDetails ArticlePubMed
TargetSodium- and chloride-dependent glycine transporter 1(Homo sapiens (Human))
Eli Lilly
Curated by ChEMBL
LigandPNGBDBM50218001(({2-[4-benzo[1,3]dioxol-5-yl-2-(thiophene-2-carbon...)
Affinity DataIC50:  19nM. Assay description: Inhibition of [14C]glycine reuptake at human GlyT1 expressed in BE(2)-C cells
In DepthDetails ArticlePubMed