BDBM50218033 (methyl-{2-[4'-methyl-3-(thiophene-2-carbonyl)-biphenyl-4-yloxy]-ethyl}-amino)-acetic acid::CHEMBL249968
SMILES CN(CCOc1ccc(cc1C(=O)c1cccs1)-c1ccc(C)cc1)CC(O)=O
InChI Key InChIKey=HAVPBEZESXVAHA-UHFFFAOYSA-N
Data  2 IC50
  Tab Delimited (TSV)   2D SDfile   Computed 3D by Vconf -m prep SDfile
Find this compound or compounds like it in BindingDB:
Activity Spreadsheet -- Enzyme Inhibition Constant Data from BindingDB
Found 2 hits for monomerid = 50218033
TargetSodium- and chloride-dependent glycine transporter 1(Homo sapiens (Human))
Eli Lilly
Curated by ChEMBL
LigandPNGBDBM50218033((methyl-{2-[4'-methyl-3-(thiophene-2-carbonyl)-bip...)
Affinity DataIC50:  59nM. Assay description: Inhibition of [14C]glycine reuptake at human GlyT1 expressed in BE(2)-C cells
In DepthDetails ArticlePubMed
TargetSodium- and chloride-dependent glycine transporter 2(Homo sapiens (Human))
Eli Lilly
Curated by ChEMBL
LigandPNGBDBM50218033((methyl-{2-[4'-methyl-3-(thiophene-2-carbonyl)-bip...)
Affinity DataIC50: >3.00E+4nM. Assay description: Inhibition of [14C]glycine reuptake at human GlyT2 expressed in BE(2)-C cells
In DepthDetails ArticlePubMed