BDBM50218958 CHEMBL1793984
SMILES [H][C@](C)(CC)[C@]1([H])NC(=O)[C@]([H])(Cc2c([nH]c3ccccc23)-c2ccccc2)NC(=O)[C@]([H])(CCCCCC(=O)CC)NC(=O)[C@@]2([H])CCCCN2C1=O
InChI Key InChIKey=KDHIRMDJSXORPI-NHNPLKQTSA-N
Data  1 IC50
  Tab Delimited (TSV)   2D SDfile   Computed 3D by Vconf -m prep SDfile
Find this compound or compounds like it in BindingDB:
Activity Spreadsheet -- Enzyme Inhibition Constant Data from BindingDB
Found 1 hit for monomerid = 50218958
TargetHistone deacetylase(Homo sapiens (Human))
Merck Research Laboratories
Curated by ChEMBL
LigandPNGBDBM50218958(CHEMBL1793984)
Affinity DataIC50:  4nM. Assay description: Inhibitory activity against histone deacetylase (HDAC) enzyme derived from partially purified extracts of human HeLa cells using [3H]11 as radioligan...
In DepthDetails ArticlePubMed