BDBM50219571 5-{3-[(1-benzenesulfonylpiperidin-4-ylmethyl)amino]phenyl}-4-bromo-3-carboxymethoxythiophene-2-carboxylic acid::CHEMBL429105
SMILES OC(=O)COc1c(Br)c(sc1C(O)=O)-c1cccc(NCC2CCN(CC2)S(=O)(=O)c2ccccc2)c1
InChI Key InChIKey=ATSMPRZVNKAHLZ-UHFFFAOYSA-N
Data  1 KI
  Tab Delimited (TSV)   2D SDfile   Computed 3D by Vconf -m prep SDfile
Find this compound or compounds like it in BindingDB:
Activity Spreadsheet -- Enzyme Inhibition Constant Data from BindingDB
Found 1 hit for monomerid = 50219571
TargetTyrosine-protein phosphatase non-receptor type 1(Homo sapiens (Human))
Wyeth Research
Curated by ChEMBL
LigandPNGBDBM50219571(5-{3-[(1-benzenesulfonylpiperidin-4-ylmethyl)amino...)
Affinity DataKi:  310nM. Assay description: Inhibition of human recombinant PTP1B
In DepthDetails ArticlePubMed