BDBM50219612 CHEMBL249061::N-(4-(2,3-difluorophenyl)thiazol-2-yl)-4-(pyrimidin-4-ylamino)benzamide
SMILES Fc1cccc(-c2csc(NC(=O)c3ccc(Nc4ccncn4)cc3)n2)c1F
InChI Key InChIKey=KJSGODHTKYUUSC-UHFFFAOYSA-N
Data  2 EC50
  Tab Delimited (TSV)   2D SDfile   Computed 3D by Vconf -m prep SDfile
Find this compound or compounds like it in BindingDB:
Activity Spreadsheet -- Enzyme Inhibition Constant Data from BindingDB
Found 2 hits for monomerid = 50219612
TargetThrombopoietin receptor(Homo sapiens (Human))
Pfizer
Curated by ChEMBL
LigandPNGBDBM50219612(CHEMBL249061 | N-(4-(2,3-difluorophenyl)thiazol-2-...)
Affinity DataEC50:  420nM. Assay description: Agonist activity at TPO receptor
In DepthDetails ArticlePubMed
TargetThrombopoietin receptor(Homo sapiens (Human))
Pfizer
Curated by ChEMBL
LigandPNGBDBM50219612(CHEMBL249061 | N-(4-(2,3-difluorophenyl)thiazol-2-...)
Affinity DataEC50:  415nM. Assay description: Agonist activity at human TPOr expressed in BaF3 cells by reporter assay
In DepthDetails ArticlePubMed