BDBM50220810 CHEMBL57226
SMILES ONC(=O)CCCCCNC(=O)c1cc2ccccc2[nH]1
InChI Key InChIKey=JFFDPSIPMOWSBG-UHFFFAOYSA-N
Data  1 IC50
  Tab Delimited (TSV)   2D SDfile   Computed 3D by Vconf -m prep SDfile
Find this compound or compounds like it in BindingDB:
Activity Spreadsheet -- Enzyme Inhibition Constant Data from BindingDB
Found 1 hit for monomerid = 50220810
TargetHistone deacetylase (HDAC1 and HDAC2)(Homo sapiens (Human))
Abbott Laboratories
Curated by ChEMBL
LigandPNGBDBM50220810(CHEMBL57226)
Affinity DataIC50:  13nM. Assay description: Inhibitory activity was tested against histone deacetylase (HDAC).
In DepthDetails ArticlePubMed