BDBM50220824 CHEMBL56782
SMILES ONC(=O)CCCCCCNC(=O)c1cn(Cc2ccccc2)c2ccccc12
InChI Key InChIKey=CBYKEEXUXKLCRB-UHFFFAOYSA-N
Data  1 IC50
  Tab Delimited (TSV)   2D SDfile   Computed 3D by Vconf -m prep SDfile
Find this compound or compounds like it in BindingDB:
Activity Spreadsheet -- Enzyme Inhibition Constant Data from BindingDB
Found 1 hit for monomerid = 50220824
TargetHistone deacetylase (HDAC1 and HDAC2)(Homo sapiens (Human))
Abbott Laboratories
Curated by ChEMBL
LigandPNGBDBM50220824(CHEMBL56782)
Affinity DataIC50:  12nM. Assay description: Inhibitory activity was tested against histone deacetylase (HDAC).
In DepthDetails ArticlePubMed