BDBM50220888 5-(3-amino-2,2-difluoropropyl)-7,8-dicyclohexyl-3-methyl-2H-pyrazolo[4,3-c]quinolin-4(5H)-one::CHEMBL250685
SMILES Cc1[nH]nc2c1c(=O)n(CC(F)(F)CN)c1cc(C3CCCCC3)c(cc21)C1CCCCC1
InChI Key InChIKey=CMSSNFCWOGLFSS-UHFFFAOYSA-N
Data  1 IC50
  Tab Delimited (TSV)   2D SDfile   Computed 3D by Vconf -m prep SDfile
Find this compound or compounds like it in BindingDB:
Activity Spreadsheet -- Enzyme Inhibition Constant Data from BindingDB
Found 1 hit for monomerid = 50220888
TargetSerine/threonine-protein kinase Chk1(Homo sapiens (Human))
Merck Research Laboratories
Curated by ChEMBL
LigandPNGBDBM50220888(5-(3-amino-2,2-difluoropropyl)-7,8-dicyclohexyl-3-...)
Affinity DataIC50:  14nM. Assay description: Inhibition of Chk1 by fluorescence assay
In DepthDetails ArticlePubMed