BDBM50220896 3-methyl-2,5-dihydro-1,2,5-triaza-cyclopenta[a]anthracen-4-one::CHEMBL251210
SMILES Cc1[nH]nc2c1c(=O)[nH]c1cc3ccccc3cc21
InChI Key InChIKey=URVQYHFWSXVWGH-UHFFFAOYSA-N
Data  1 IC50
  Tab Delimited (TSV)   2D SDfile   Computed 3D by Vconf -m prep SDfile
Find this compound or compounds like it in BindingDB:
Activity Spreadsheet -- Enzyme Inhibition Constant Data from BindingDB
Found 1 hit for monomerid = 50220896
TargetSerine/threonine-protein kinase Chk1(Homo sapiens (Human))
Merck Research Laboratories
Curated by ChEMBL
LigandPNGBDBM50220896(3-methyl-2,5-dihydro-1,2,5-triaza-cyclopenta[a]ant...)
Affinity DataIC50:  29nM. Assay description: Inhibition of Chk1 by fluorescence assay
In DepthDetails ArticlePubMed