BDBM50220906 9-chloro-3-methyl-2H-pyrazolo[4,3-c]quinolin-4(5H)-one::CHEMBL251018
SMILES Cc1[nH]nc2c1c(=O)[nH]c1cccc(Cl)c21
InChI Key InChIKey=MGFBGRNHDKBQQL-UHFFFAOYSA-N
Data  1 IC50
  Tab Delimited (TSV)   2D SDfile   Computed 3D by Vconf -m prep SDfile
Find this compound or compounds like it in BindingDB:
Activity Spreadsheet -- Enzyme Inhibition Constant Data from BindingDB
Found 1 hit for monomerid = 50220906
TargetSerine/threonine-protein kinase Chk1(Homo sapiens (Human))
Merck Research Laboratories
Curated by ChEMBL
LigandPNGBDBM50220906(9-chloro-3-methyl-2H-pyrazolo[4,3-c]quinolin-4(5H)...)
Affinity DataIC50:  2.89E+4nM. Assay description: Inhibition of Chk1 by fluorescence assay
In DepthDetails ArticlePubMed