BDBM50220968 1-((3R,3aR)-8-fluoro-3-phenyl-3a,4-dihydro-3H-5-oxa-1,9b-diaza-cyclopenta[a]naphthalen-2-yl)-ethanone::CHEMBL251103
SMILES CC(=O)C1=NN2[C@@H](COc3ccc(F)cc23)[C@H]1c1ccccc1
InChI Key InChIKey=ADYNHNURDOHRNB-DOTOQJQBSA-N
Data  1 IC50
  Tab Delimited (TSV)   2D SDfile   Computed 3D by Vconf -m prep SDfile
Find this compound or compounds like it in BindingDB:
Activity Spreadsheet -- Enzyme Inhibition Constant Data from BindingDB
Found 1 hit for monomerid = 50220968
TargetKinesin-like protein KIF11(Homo sapiens (Human))
Merck Research Laboratories
Curated by ChEMBL
LigandPNGBDBM50220968(1-((3R,3aR)-8-fluoro-3-phenyl-3a,4-dihydro-3H-5-ox...)
Affinity DataIC50:  155nM. Assay description: Inhibition of kinesin spindle protein
In DepthDetails ArticlePubMed