BDBM50221169 8a-benzyl-2-(phenylsulfonyl)-1,2,3,4,8,8a-hexahydroisoquinolin-6(7H)-one::CHEMBL393061
SMILES O=C1CCC2(Cc3ccccc3)CN(CCC2=C1)S(=O)(=O)c1ccccc1
InChI Key InChIKey=MLKHMNLURPWDME-UHFFFAOYSA-N
Data  1 KI
  Tab Delimited (TSV)   2D SDfile   Computed 3D by Vconf -m prep SDfile
Find this compound or compounds like it in BindingDB:
Activity Spreadsheet -- Enzyme Inhibition Constant Data from BindingDB
Found 1 hit for monomerid = 50221169
TargetGlucocorticoid receptor(Homo sapiens (Human))
Corcept Therapeutics
Curated by ChEMBL
LigandPNGBDBM50221169(8a-benzyl-2-(phenylsulfonyl)-1,2,3,4,8,8a-hexahydr...)
Affinity DataKi:  225nM. Assay description: Displacement of [3H]dexamethasone from human glucocorticoid receptor expressed in recombinant baculovirus
In DepthDetails ArticlePubMed