BDBM50221220 1-(4-(1H-pyrrolo[3,2-c]pyridin-3-yl)piperidin-1-yl)-3-(3-(4-bromophenyl)-5-(methylsulfonyl)-4,5,6,7-tetrahydropyrazolo[4,3-c]pyridin-1-yl)propan-2-ol::CHEMBL236073
SMILES CS(=O)(=O)N1CCc2c(C1)c(nn2CC(O)CN1CCC(CC1)c1c[nH]c2ccncc12)-c1ccc(Br)cc1
InChI Key InChIKey=JCPYLQMDIBMVPM-UHFFFAOYSA-N
Data  2 IC50
  Tab Delimited (TSV)   2D SDfile   Computed 3D by Vconf -m prep SDfile
Find this compound or compounds like it in BindingDB:
Activity Spreadsheet -- Enzyme Inhibition Constant Data from BindingDB
Found 2 hits for monomerid = 50221220
TargetCathepsin S(Homo sapiens (Human))
Johnson & Johnson Pharmaceutical Research & Development
Curated by ChEMBL
LigandPNGBDBM50221220(1-(4-(1H-pyrrolo[3,2-c]pyridin-3-yl)piperidin-1-yl...)
Affinity DataIC50:  150nM. Assay description: Inhibition of cathepsin S in human JY cells by invariant chain degradation assay
In DepthDetails ArticlePubMed
TargetCathepsin S(Homo sapiens (Human))
Johnson & Johnson Pharmaceutical Research & Development
Curated by ChEMBL
LigandPNGBDBM50221220(1-(4-(1H-pyrrolo[3,2-c]pyridin-3-yl)piperidin-1-yl...)
Affinity DataIC50:  77nM. Assay description: Inhibition of human cathepsin S
In DepthDetails ArticlePubMed