BDBM50221807 CHEMBL115049
SMILES OC(=O)C(=O)CCCCCCOc1ccc(cc1)-c1ccccc1
InChI Key InChIKey=VREZMJDAPPMITK-UHFFFAOYSA-N
Data  1 IC50
  Tab Delimited (TSV)   2D SDfile   Computed 3D by Vconf -m prep SDfile
Find this compound or compounds like it in BindingDB:
Activity Spreadsheet -- Enzyme Inhibition Constant Data from BindingDB
Found 1 hit for monomerid = 50221807
TargetHistone deacetylase (HDAC1 and HDAC2)(Homo sapiens (Human))
Abbott Laboratories
Curated by ChEMBL
LigandPNGBDBM50221807(CHEMBL115049)
Affinity DataIC50:  3.70nM. Assay description: Inhibitory activity against mixture of histone deacetylase 1 (HDAC1) and histone deacetylase 2 (HDAC2) from nuclear extraction of K562 erythroleukemi...
In DepthDetails ArticlePubMed