BDBM50221858 (1S,2R,4S,5R,6R,7S,9R,12R)-5-(acetyloxy)-12-[(furan-2-yl)carbonyloxy]-2-hydroxy-2,6,10,10-tetramethyl-4-(pentyloxy)-11-oxatricyclo[7.2.1.0^{1,6}]dodecan-7-yl furan-2-carboxylate::CHEMBL231887
SMILES CCCCCO[C@H]1C[C@@](C)(O)[C@]23OC(C)(C)[C@H](C[C@H](OC(=O)c4ccco4)[C@]2(C)[C@H]1OC(C)=O)[C@H]3OC(=O)c1ccco1
InChI Key InChIKey=ISJKTKUYWUHOHW-MWHDTRAWSA-N
Data  1 KI
  Tab Delimited (TSV)   2D SDfile   Computed 3D by Vconf -m prep SDfile
Find this compound or compounds like it in BindingDB:
Activity Spreadsheet -- Enzyme Inhibition Constant Data from BindingDB
Found 1 hit for monomerid = 50221858
TargetATP-dependent translocase ABCB1(Homo sapiens (Human))
Instituto Universitario De Bio-Organica Antonio Gonzalez
Curated by ChEMBL
LigandPNGBDBM50221858((1S,2R,4S,5R,6R,7S,9R,12R)-5-(acetyloxy)-12-[(fura...)
Affinity DataKi:  570nM. Assay description: Inhibition of human Pgp-mediated DNR transport in NIH3T3 cells by microplate assay
In DepthDetails ArticlePubMed