BDBM50221988 CHEMBL113566
SMILES CN(C)C(=O)C(=O)CCCCCCOc1ccc(cc1)-c1ccccc1
InChI Key InChIKey=WNFPRQUEDLLACK-UHFFFAOYSA-N
Data  1 IC50
  Tab Delimited (TSV)   2D SDfile   Computed 3D by Vconf -m prep SDfile
Find this compound or compounds like it in BindingDB:
Activity Spreadsheet -- Enzyme Inhibition Constant Data from BindingDB
Found 1 hit for monomerid = 50221988
TargetHistone deacetylase (HDAC1 and HDAC2)(Homo sapiens (Human))
Abbott Laboratories
Curated by ChEMBL
LigandPNGBDBM50221988(CHEMBL113566)
Affinity DataIC50: >5nM. Assay description: Inhibitory activity against mixture of histone deacetylase 1 (HDAC1) and histone deacetylase 2 (HDAC2) from nuclear extraction of K562 erythroleukemi...
In DepthDetails ArticlePubMed