BDBM50222128 CHEMBL313218
SMILES COC1\C=C\OC2(C)Oc3c(C2=O)c2cc(\C=N\N4CCCCC4)c(NC(=O)\C(C)=C/C=C/C(C)C(O)C(C)C(O)C(C)C(OC(C)=O)C1C)c(O)c2c(O)c3C
InChI Key InChIKey=KNLGAXJSICDYPJ-NYUNDPKHSA-N
Data  1 KI
  Tab Delimited (TSV)   2D SDfile   Computed 3D by Vconf -m prep SDfile
Find this compound or compounds like it in BindingDB:
Activity Spreadsheet -- Enzyme Inhibition Constant Data from BindingDB
Found 1 hit for monomerid = 50222128
TargetGag-Pol polyprotein(Woolly monkey sarcoma virus)
TBA
Curated by ChEMBL
LigandPNGBDBM50222128(CHEMBL313218)
Affinity DataKi:  1.74E+7nM. Assay description: Ability to inhibit simian virus reverse transcriptase, expressed as log Ki.
In DepthDetails ArticlePubMed