BDBM50222363 CHEMBL125042
SMILES ONC(=O)CCCCCCc1nc(cs1)-c1cccc(Br)c1
InChI Key InChIKey=OSNWZDUTDCCVCX-UHFFFAOYSA-N
Data  1 IC50
  Tab Delimited (TSV)   2D SDfile   Computed 3D by Vconf -m prep SDfile
Find this compound or compounds like it in BindingDB:
Activity Spreadsheet -- Enzyme Inhibition Constant Data from BindingDB
Found 1 hit for monomerid = 50222363
TargetHistone deacetylase (HDAC1 and HDAC2)(Homo sapiens (Human))
Abbott Laboratories
Curated by ChEMBL
LigandPNGBDBM50222363(CHEMBL125042)
Affinity DataIC50:  5.80nM. Assay description: Inhibitory activity against histone deacetylase (HDAC1 and HDAC2) isolated from K562 erythroleukemia cells
In DepthDetails ArticlePubMed