BDBM50223593 3-bromo-5-(2-chlorophenyl)-N-(4-(methylsulfonyl)phenyl)pyrazolo[1,5-a]pyrimidin-7-amine::CHEMBL400240
SMILES CS(=O)(=O)c1ccc(Nc2cc(nc3c(Br)cnn23)-c2ccccc2Cl)cc1
InChI Key InChIKey=TUGJJKKQXXMMGU-UHFFFAOYSA-N
Data  1 IC50
  Tab Delimited (TSV)   2D SDfile   Computed 3D by Vconf -m prep SDfile
Find this compound or compounds like it in BindingDB:
Activity Spreadsheet -- Enzyme Inhibition Constant Data from BindingDB
Found 1 hit for monomerid = 50223593
TargetGlycogen synthase kinase-3 beta(Homo sapiens (Human))
Schering-Plough Research Institute
Curated by ChEMBL
LigandPNGBDBM50223593(3-bromo-5-(2-chlorophenyl)-N-(4-(methylsulfonyl)ph...)
Affinity DataIC50:  450nM. Assay description: Inhibition of human GSK3beta
In DepthDetails ArticlePubMed