BDBM50223609 3-bromo-5-phenyl-N-((pyridin-3-yloxy)methyl)pyrazolo[1,5-a]pyrimidin-7-amine::CHEMBL250148
SMILES Brc1cnn2c(NCOc3cccnc3)cc(nc12)-c1ccccc1
InChI Key InChIKey=DJTAYMHBNPHQLL-UHFFFAOYSA-N
Data  1 IC50
  Tab Delimited (TSV)   2D SDfile   Computed 3D by Vconf -m prep SDfile
Find this compound or compounds like it in BindingDB:
Activity Spreadsheet -- Enzyme Inhibition Constant Data from BindingDB
Found 1 hit for monomerid = 50223609
TargetGlycogen synthase kinase-3 beta(Homo sapiens (Human))
Schering-Plough Research Institute
Curated by ChEMBL
LigandPNGBDBM50223609(3-bromo-5-phenyl-N-((pyridin-3-yloxy)methyl)pyrazo...)
Affinity DataIC50:  600nM. Assay description: Inhibition of human GSK3beta
In DepthDetails ArticlePubMed