BDBM50223848 CHEMBL10241
SMILES COc1ccc(Sc2ccc(NC3=NCCN3)cc2)cc1
InChI Key InChIKey=UOOXLFWNTJCBFC-UHFFFAOYSA-N
Data  2 KI
  Tab Delimited (TSV)   2D SDfile   Computed 3D by Vconf -m prep SDfile
Find this compound or compounds like it in BindingDB:
Activity Spreadsheet -- Enzyme Inhibition Constant Data from BindingDB
Found 2 hits for monomerid = 50223848
TargetProstacyclin receptor(Homo sapiens (Human))
Roche Palo Alto
Curated by ChEMBL
LigandPNGBDBM50223848(CHEMBL10241)
Affinity DataKi:  50nM. Assay description: Binding affinity towards prostacyclin receptor on rat NG-108-15 neuroblastoma cells, using [3H]iloprost as a radioligand
In DepthDetails ArticlePubMed
TargetProstacyclin receptor(Homo sapiens (Human))
Roche Palo Alto
Curated by ChEMBL
LigandPNGBDBM50223848(CHEMBL10241)
Affinity DataKi:  50nM. Assay description: Binding affinity towards prostacyclin receptor on rat NG-108-15 neuroblastoma cells, using [3H]iloprost as a radioligand
In DepthDetails ArticlePubMed