BDBM50223895 (S)-3-{3'-[(pyridine-3-carbonyl)-amino]-biphenyl-4-yl}-2-(2,4,6-trimethyl-benzenesulfonylamino)-propionic acid::CHEMBL249380
SMILES Cc1cc(C)c(c(C)c1)S(=O)(=O)N[C@@H](Cc1ccc(cc1)-c1cccc(NC(=O)c2cccnc2)c1)C(O)=O
InChI Key InChIKey=UKAQISBBLIRWPF-MHZLTWQESA-N
Data  1 KI
  Tab Delimited (TSV)   2D SDfile   Computed 3D by Vconf -m prep SDfile
Find this compound or compounds like it in BindingDB:
Activity Spreadsheet -- Enzyme Inhibition Constant Data from BindingDB
Found 1 hit for monomerid = 50223895
TargetIntegrin alpha-V/beta-3(Homo sapiens (Human))
Bayer Healthcare
Curated by ChEMBL
LigandPNGBDBM50223895((S)-3-{3'-[(pyridine-3-carbonyl)-amino]-biphenyl-4...)
Affinity DataKi:  400nM. Assay description: Binding affinity to integrin alphavbeta3 receptor
In DepthDetails ArticlePubMed