BDBM50224111 1-(4-(methylthio)phenyl)-5-p-tolyl-3-(trifluoromethyl)-1H-pyrazole::4-[5-(4-methylphenyl)-3-trifluoromethyl-1H-pyrazol-1-yl]-1-methylthio-benzene::CHEMBL241969
SMILES CSc1ccc(cc1)-n1nc(cc1-c1ccc(C)cc1)C(F)(F)F
InChI Key InChIKey=FSNCQAFYBNJJDF-UHFFFAOYSA-N
Data  1 IC50
  Tab Delimited (TSV)   2D SDfile   Computed 3D by Vconf -m prep SDfile
Find this compound or compounds like it in BindingDB:
Activity Spreadsheet -- Enzyme Inhibition Constant Data from BindingDB
Found 1 hit for monomerid = 50224111
TargetCytochrome P450 2C9(Homo sapiens (Human))
Astrazeneca R&D MöLndal
Curated by ChEMBL
LigandPNGBDBM50224111(1-(4-(methylthio)phenyl)-5-p-tolyl-3-(trifluoromet...)
Affinity DataIC50: >4.00E+4nM. Assay description: Inhibition of recombinant CYP2C9 by fluorescence inhibition assay
In DepthDetails ArticlePubMed