BDBM50224196 CHEMBL43723
SMILES CC(C)(C)COc1cc(ccc1C\N=C(/S)NCc1ccc(NS(C)(=O)=O)c(F)c1)C(C)(C)C
InChI Key InChIKey=HJGAZEZOYHABKE-UHFFFAOYSA-N
Data  1 IC50
  Tab Delimited (TSV)   2D SDfile   Computed 3D by Vconf -m prep SDfile
Find this compound or compounds like it in BindingDB:
Activity Spreadsheet -- Enzyme Inhibition Constant Data from BindingDB
Found 1 hit for monomerid = 50224196
TargetTransient receptor potential cation channel subfamily V member 1/2/4(Rattus norvegicus)
Seoul National University
Curated by ChEMBL
LigandPNGBDBM50224196(CHEMBL43723)
Affinity DataIC50:  66nM. Assay description: In vitro inhibitory concentration was determined against [45Ca2+]- influx in rat DRG neurons
In DepthDetails ArticlePubMed