BDBM50224243 CHEMBL298583
SMILES Cl.[H][C@@]1(CCCCN1)[C@H](C(=O)OC)c1ccc(cc1)-c1ccccc1
InChI Key InChIKey=ZMBWQQLMWITGKC-STYNFMPRSA-N
Data  1 IC50
  Tab Delimited (TSV)   2D SDfile   Computed 3D by Vconf -m prep SDfile
Find this compound or compounds like it in BindingDB:
Activity Spreadsheet -- Enzyme Inhibition Constant Data from BindingDB
Found 1 hit for monomerid = 50224243
TargetD(1A)/D(1B)/D(2)/D(3)/D(4) dopamine receptor(Rattus norvegicus (rat))
State University Of New York
Curated by ChEMBL
LigandPNGBDBM50224243(CHEMBL298583)
Affinity DataIC50:  1.02E+3nM. Assay description: Potency of inhibiting 10 pM [125I]-RTI-55 binding to dopamine receptor in rat striatal membranes
In DepthDetails ArticlePubMed